Target
Dual specificity protein kinase CLK2
Ligand
BDBM317477
Substrate
Meas. Tech.
Radioactivity Based Kinase Assay
IC50
10.4±n/a nM
Citation
 Zhu, DBoylan, JXu, SRiggs, JShi, TWurmser, AMikolon, DDeyanat-Yazdi, G Methods of treating a cancer using substituted pyrrolopyrimidine compounds, compositions thereof US Patent  US9623028 Publication Date 4/18/2017 
Target
Name:
Dual specificity protein kinase CLK2
Synonyms:
2.7.12.1 CDC-like kinase 2 (CLK2) CLK2 | CLK2_HUMAN
Type:
Mol. Mass.:
60128.79
Organism:
Homo sapiens (Human)
Description:
P49760
Residue:
499
  
Inhibitor
Name:
BDBM317477
Synonyms:
4-(4-(cyclopentyloxy)-5-(2- methylbenzo[d]oxazol-6-yl)-7H- pyrrolo[2,3-d]pyrimidin-2- ylamino)-2-fluoro-5-methoxy-N- methylbenzamide | US9623028, Compound 237
Type:
Small organic molecule
Emp. Form.:
C28H27FN6O4
Mol. Mass.:
530.5502
SMILES:
CNC(=O)c1cc(OC)c(Nc2nc(OC3CCCC3)c3c(c[nH]c3n2)-c2ccc3nc(C)oc3c2)cc1F
: