Target
Dual specificity protein kinase TTK
Ligand
BDBM317478
Substrate
Meas. Tech.
Radioactivity Based Kinase Assay
IC50
4.54±n/a nM
Citation
 Zhu, DBoylan, JXu, SRiggs, JShi, TWurmser, AMikolon, DDeyanat-Yazdi, G Methods of treating a cancer using substituted pyrrolopyrimidine compounds, compositions thereof US Patent  US9623028 Publication Date 4/18/2017 
Target
Name:
Dual specificity protein kinase TTK
Synonyms:
Dual specificity protein kinase (TTK) MPS1 Monopolar Spindle 1 (MPS1) Monopolar Spindle 1 Kinase (MPS1) TTK | TTK_HUMAN
Type:
Protein
Mol. Mass.:
97086.79
Organism:
Homo sapiens (Human)
Description:
P33981
Residue:
857
  
Inhibitor
Name:
BDBM317478
Synonyms:
4-(4-(cyclopentyloxy)-5-(2- methylbenzo[d]oxazol-6-yl)-7H- pyrrolo[2,3-d]pyrimidin-2- ylamino)-3-methoxy-N-(1- methylazetidin-3-yl)benzamide | US9623028, Compound 300
Type:
Small organic molecule
Emp. Form.:
C31H33N7O4
Mol. Mass.:
567.6382
SMILES:
COc1cc(ccc1Nc1nc(OC2CCCC2)c2c(c[nH]c2n1)-c1ccc2nc(C)oc2c1)C(=O)NC1CN(C)C1
: