Target
Dual specificity protein kinase TTK
Ligand
BDBM317480
Substrate
Meas. Tech.
Radioactivity Based Kinase Assay
IC50
1.42±n/a nM
Citation
 Zhu, DBoylan, JXu, SRiggs, JShi, TWurmser, AMikolon, DDeyanat-Yazdi, G Methods of treating a cancer using substituted pyrrolopyrimidine compounds, compositions thereof US Patent  US9623028 Publication Date 4/18/2017 
Target
Name:
Dual specificity protein kinase TTK
Synonyms:
Dual specificity protein kinase (TTK) MPS1 Monopolar Spindle 1 (MPS1) Monopolar Spindle 1 Kinase (MPS1) TTK | TTK_HUMAN
Type:
Protein
Mol. Mass.:
97086.79
Organism:
Homo sapiens (Human)
Description:
P33981
Residue:
857
  
Inhibitor
Name:
BDBM317480
Synonyms:
4-(4-isopropoxy-5-(4- (methylcarbamoyl)phenyl)-7H- pyrrolo[2,3-d]pyrimidin-2- ylamino)-3-methoxy-N-(oxetan- 3-yl)benzamide | US9623028, Compound 334
Type:
Small organic molecule
Emp. Form.:
C28H30N6O5
Mol. Mass.:
530.575
SMILES:
CNC(=O)c1ccc(cc1)-c1c[nH]c2nc(Nc3ccc(cc3OC)C(=O)NC3COC3)nc(OC(C)C)c12
: