Target
Dual specificity protein kinase TTK
Ligand
BDBM317481
Substrate
Meas. Tech.
Radioactivity Based Kinase Assay
IC50
7.00±n/a nM
Citation
 Zhu, DBoylan, JXu, SRiggs, JShi, TWurmser, AMikolon, DDeyanat-Yazdi, G Methods of treating a cancer using substituted pyrrolopyrimidine compounds, compositions thereof US Patent  US9623028 Publication Date 4/18/2017 
Target
Name:
Dual specificity protein kinase TTK
Synonyms:
Dual specificity protein kinase (TTK) MPS1 Monopolar Spindle 1 (MPS1) Monopolar Spindle 1 Kinase (MPS1) TTK | TTK_HUMAN
Type:
Protein
Mol. Mass.:
97086.79
Organism:
Homo sapiens (Human)
Description:
P33981
Residue:
857
  
Inhibitor
Name:
BDBM317481
Synonyms:
4-(4-cyclobutoxy-5-(2- methylbenzo[d]oxazol-6-yl)-7H- pyrrolo[2,3-d]pyrimidin-2- ylamino)-3-methoxy-N-(oxetan- 3-yl)benzamide | US9623028, Compound 339
Type:
Small organic molecule
Emp. Form.:
C29H28N6O5
Mol. Mass.:
540.5698
SMILES:
COc1cc(ccc1Nc1nc(OC2CCC2)c2c(c[nH]c2n1)-c1ccc2nc(C)oc2c1)C(=O)NC1COC1
: