Target
Dual specificity protein kinase TTK
Ligand
BDBM317482
Substrate
Meas. Tech.
Radioactivity Based Kinase Assay
IC50
1.15±n/a nM
Citation
 Zhu, DBoylan, JXu, SRiggs, JShi, TWurmser, AMikolon, DDeyanat-Yazdi, G Methods of treating a cancer using substituted pyrrolopyrimidine compounds, compositions thereof US Patent  US9623028 Publication Date 4/18/2017 
Target
Name:
Dual specificity protein kinase TTK
Synonyms:
Dual specificity protein kinase (TTK) MPS1 Monopolar Spindle 1 (MPS1) Monopolar Spindle 1 Kinase (MPS1) TTK | TTK_HUMAN
Type:
Protein
Mol. Mass.:
97086.79
Organism:
Homo sapiens (Human)
Description:
P33981
Residue:
857
  
Inhibitor
Name:
BDBM317482
Synonyms:
4-(4-((1s,4s)-4-hydroxy-4- methylcyclohexyloxy)-5-(4- (methylcarbamoyl)phenyl)-7H- pyrrolo[2,3-d]pyrimidin-2- ylamino)-3-methoxy-N-(1- methylazetidin-3-yl)benzamide | US9623028, Compound 349
Type:
Small organic molecule
Emp. Form.:
C33H39N7O5
Mol. Mass.:
613.7067
SMILES:
CNC(=O)c1ccc(cc1)-c1c[nH]c2nc(Nc3ccc(cc3OC)C(=O)NC3CN(C)C3)nc(OC3CC[C@@](C)(O)CC3)c12
: