Target
Dual specificity protein kinase TTK
Ligand
BDBM317485
Substrate
Meas. Tech.
Radioactivity Based Kinase Assay
IC50
1.90±n/a nM
Citation
 Zhu, DBoylan, JXu, SRiggs, JShi, TWurmser, AMikolon, DDeyanat-Yazdi, G Methods of treating a cancer using substituted pyrrolopyrimidine compounds, compositions thereof US Patent  US9623028 Publication Date 4/18/2017 
Target
Name:
Dual specificity protein kinase TTK
Synonyms:
Dual specificity protein kinase (TTK) MPS1 Monopolar Spindle 1 (MPS1) Monopolar Spindle 1 Kinase (MPS1) TTK | TTK_HUMAN
Type:
Protein
Mol. Mass.:
97086.79
Organism:
Homo sapiens (Human)
Description:
P33981
Residue:
857
  
Inhibitor
Name:
BDBM317485
Synonyms:
3-chloro-N-methyl-4-(5-(1- methyl-1H-pyrazol-4-yl)-4- (tetrahydro-2H-pyran-4-yloxy)- 7H-pyrrolo[2,3-d]pyrimidin-2- ylamino)benzamide | US9623028, Compound 423
Type:
Small organic molecule
Emp. Form.:
C23H24ClN7O3
Mol. Mass.:
481.935
SMILES:
CNC(=O)c1ccc(Nc2nc(OC3CCOCC3)c3c(c[nH]c3n2)-c2cnn(C)c2)c(Cl)c1
: