Target
Cyclin-T1/Cyclin-dependent kinase 9
Ligand
BDBM187124
Substrate
Meas. Tech.
CDK9/CycT1 High ATP Kinase Assay
pH
8±n/a
IC50
1±0.0 nM
Comments
extracted
Citation
 Lücking, UBöhnke, NScholz, ALienau, PSiemeister, GBömer, UKosemund, DBohlmann, RZorn, L 5-fluoro-N-(pyridin-2-yl)pyridin-2-amine derivatives containing a sulfone group US Patent  US9670161 Publication Date 6/6/2017 
Target
Name:
Cyclin-T1/Cyclin-dependent kinase 9
Synonyms:
CDK9/ Cyclin-T1 CDK9/Cyclin T Cyclin T1/dependent kinase 9 | Cyclin-Dependent Kinase 9 (CDK9)
Type:
Protein Complex
Mol. Mass.:
Description:
Components:
This complex has 2 components.
Component 1
Name:
Cyclin-T1
Synonyms:
CCNT1 CycT Cyclin T Cyclin-T
Type:
Enzyme Subunit
Mol. Mass.:
80712.40
Organism:
Homo sapiens (Human)
Description:
Residue:
726
  
Component 2
Name:
Cyclin-dependent kinase 9
Synonyms:
C-2K CDK9 Cell division cycle 2-like protein kinase 4 Cyclin-Dependent Kinase 9 (CDK9) Serine/threonine-protein kinase PITALRE Tat-associated kinase complex catalytic subunit
Type:
Enzyme Subunit
Mol. Mass.:
42789.13
Organism:
Homo sapiens (Human)
Description:
Residue:
372
  
Inhibitor
Name:
BDBM187124
Synonyms:
US9670161, 5 N-{6-(Difluoromethyl)-4-[(methylsulfonyl)methyl]pyridin-2-yl}-5-fluoro-4-(4-fluoro-2-methoxyphenyl)pyridin-2-amine
Type:
Small organic molecule
Emp. Form.:
C20H17F4N3O3S
Mol. Mass.:
455.426
SMILES:
COc1cc(F)ccc1-c1cc(Nc2cc(CS(C)(=O)=O)cc(n2)C(F)F)ncc1F
: