Target
Acetylcholinesterase
Ligand
BDBM10986
Substrate
BDBM8959
Meas. Tech.
Cholinesterase Inhibition Assay
IC50
>10000±n/a nM
Citation
 Yu, QHolloway, HWFlippen-Anderson, JLHoffman, BBrossi, AGreig, NH Methyl analogues of the experimental Alzheimer drug phenserine: synthesis and structure/activity relationships for acetyl- and butyrylcholinesterase inhibitory action. J Med Chem 44:4062-71 (2001)  
Target
Name:
Acetylcholinesterase
Synonyms:
ACES_HUMAN Acetylcholinesterase (AChE) | Acetylcholinesterase (human AChE)
Type:
Enzyme
Mol. Mass.:
67792.70
Organism:
Homo sapiens (Human)
Description:
P22303
Residue:
614
  
Inhibitor
Name:
BDBM10986
Synonyms:
(3aS,8aR)-1,3a,6,8-tetramethyl-1,2,3,3a,8,8a-hexahydropyrrolo[2,3-b]indol-5-yl methylcarbamate 6-methylphysostigmine | Physostigmine analog 31
Type:
Small organic molecule
Emp. Form.:
C16H23N3O2
Mol. Mass.:
289.3727
SMILES:
[H][C@]12N(C)CC[C@@]1(C)c1cc(OC(=O)NC)c(C)cc1N2C
:
Substrate
Name:
BDBM8959
Synonyms:
(2-Mercaptoethyl)trimethylammonium iodide acetate Acetylthiocholine acetylthiocholine chloride | acetylthiocholine iodide
Type:
Small organic molecule
Emp. Form.:
C7H16NOS
Mol. Mass.:
162.272
SMILES:
CC(=O)SCC[N+](C)(C)C
: