Target
Cytochrome P450 2C8
Ligand
BDBM191369
Substrate
Meas. Tech.
Human Neutrophil Elastase Assay
pH
7.5±n/a
Temperature
298.15±n/a K
IC50
10900±n/a nM
Comments
extracted
Citation
 Gnamm, COost, TPeters, SHoesch, HRies, UJ Substituted bicyclic dihydropyrimidinones and their use as inhibitors of neutrophil elastase activity US Patent  US9670166 Publication Date 6/6/2017 
Target
Name:
Cytochrome P450 2C8
Synonyms:
CP2C8_HUMAN CYPIIC8 P450 IIC2 P450 form 1 | S-mephenytoin 4-hydroxylase
Type:
Protein
Mol. Mass.:
55839.23
Organism:
Homo sapiens (Human)
Description:
P10632
Residue:
490
  
Inhibitor
Name:
BDBM191369
Synonyms:
WO2005082863, Example 8A | example 8A disclosed in WO 2005/082863
Type:
Emp. Form.:
C15H12F3N3O2
Mol. Mass.:
323.2699
SMILES:
CC(=O)C1=C(C)N(C(=O)N[C@H]1C#N)c1cccc(c1)C(F)(F)F
: