Target
Neutrophil elastase
Ligand
BDBM211763
Substrate
Meas. Tech.
Human Neutrophil Elastase Assay
pH
7.5±n/a
Temperature
298.15±n/a K
IC50
1.20±n/a nM
Comments
extracted
Citation
 Gnamm, COost, TPeters, SHoesch, HRies, UJ Substituted bicyclic dihydropyrimidinones and their use as inhibitors of neutrophil elastase activity US Patent  US9670166 Publication Date 6/6/2017 
Target
Name:
Neutrophil elastase
Synonyms:
Bone marrow serine protease Coagulation factor X ELANE Elastase HLE Leukocyte elastase Medullasin Neutrophil elastase (HNE) PMN elastase Trypsin
Type:
Enzyme
Mol. Mass.:
28532.38
Organism:
Homo sapiens (Human)
Description:
P08246
Residue:
267
  
Inhibitor
Name:
BDBM211763
Synonyms:
US9290459, 14A | US9670166, 14A
Type:
Small organic molecule
Emp. Form.:
C23H18F3N3O4S
Mol. Mass.:
489.467
SMILES:
CCS(=O)(=O)c1cc(ccc1[C@H]1NC(=O)N(C2=C1C(=O)CC2)c1cccc(c1)C(F)(F)F)C#N
: