Target
Poly [ADP-ribose] polymerase tankyrase-1
Ligand
BDBM318041
Substrate
Meas. Tech.
Biochemical Assay
IC50
19.8±15.9 nM
Citation
 Chedid, MEissa, HOEngler, TAFurness, KWRank, KBWoods, TAWrobleski, AD Pyrido[2,3-d]pyrimidin-4-one compounds as tankyrase inhibitors US Patent  US9624218 Publication Date 4/18/2017 
Target
Name:
Poly [ADP-ribose] polymerase tankyrase-1
Synonyms:
(ARTD5 or PARP5a) PARPL Poly [ADP-ribose] polymerase tankyrase-1 TINF1 TNKS1 Tankyrase 1 Tankyrase-1 Tankyrase-1 (TNKS1)
Type:
Enzyme
Mol. Mass.:
142058.03
Organism:
Homo sapiens (Human)
Description:
O95271
Residue:
1327
  
Inhibitor
Name:
BDBM318041
Synonyms:
8-Methyl-2-[4-(pyrazin-2-ylmethyl)piperazin-1-yl]-3,5,6,7-tetrahydropyrido[2,3-d]pyrimidin-4-one | US9624218, Example 42
Type:
Small organic molecule
Emp. Form.:
C17H23N7O
Mol. Mass.:
341.4108
SMILES:
CN1CCCc2c1nc([nH]c2=O)N1CCN(Cc2cnccn2)CC1
: