Target
cAMP and cAMP-inhibited cGMP 3',5'-cyclic phosphodiesterase 10A
Ligand
BDBM187210
Substrate
Meas. Tech.
Phosphodiesterase Assay
pH
7.4±n/a
Temperature
298.15±n/a K
IC50
0.30±n/a nM
Comments
extracted
Citation
 Leblond, BChauvignac, CTaverne, TBeausoleil, ECasagrande, ADesire, LPando, MPDonello, JEYang, R Substituted 6,7-dialkoxy-3-isoquinolinol derivatives as inhibitors of phosphodiesterase 10 (PDE 10A) US Patent  US9670181 Publication Date 6/6/2017 
Target
Name:
cAMP and cAMP-inhibited cGMP 3',5'-cyclic phosphodiesterase 10A
Synonyms:
3',5'-cyclic phosphodiesterase PDE10A Phosphodiesterase 10 (PDE10) | Phosphodiesterase 10A
Type:
Protein
Mol. Mass.:
88412.52
Organism:
Homo sapiens (Human)
Description:
Q9Y233
Residue:
1055
  
Inhibitor
Name:
BDBM187210
Synonyms:
US9670181, 86 4-((6-ethoxy-2-(ethylamino)-7-fluoroquinolin-3-yl)methyl)-6,7-dimethoxy-1-propylisoquinolin-3-ol
Type:
Small organic molecule
Emp. Form.:
C28H32FN3O4
Mol. Mass.:
493.5698
SMILES:
CCCc1nc(O)c(Cc2cc3cc(OCC)c(F)cc3nc2NCC)c2cc(OC)c(OC)cc12
: