Target
Bromodomain-containing protein 3
Ligand
BDBM318842
Substrate
Meas. Tech.
In-Vitro Binding Assay
IC50
<11.0±n/a nM
Citation
 Blank, JBold, GCotesta, SGuagnano, VRueeger, H Pyrazolo-pyrrolidin-4-one derivatives as bet inhibitors and their use in the treatment of disease US Patent  US9624247 Publication Date 4/18/2017 
Target
Name:
Bromodomain-containing protein 3
Synonyms:
BRD3 Bromodomain and extra-terminal motif (BET) Bromodomain-containing protein 3 (BRD3) RING3-like protein | RING3L
Type:
Protein
Mol. Mass.:
79571.81
Organism:
Homo sapiens (Human)
Description:
Q15059
Residue:
726
  
Inhibitor
Name:
BDBM318842
Synonyms:
6-(4-chlorophenyl)-3-cyclopropyl-5-(3-(difluoromethyl)-8-methyl-[1,2,4]triazolo[4,3-a]pyridin-6-yl)-1-methyl-5,6-dihydropyrrolo[3,4-c]pyrazol-4(1H)-one | US9624247, Example 4
Type:
Small organic molecule
Emp. Form.:
C25H25ClN6O2
Mol. Mass.:
476.958
SMILES:
COCCn1nc(C2CC2)c2C(=O)N(C(c12)c1ccc(Cl)cc1)c1cc(C)c2nnc(C)n2c1
: