Target
Bromodomain-containing protein 2
Ligand
BDBM318861
Substrate
Meas. Tech.
In-Vitro Binding Assay
IC50
<11.0±n/a nM
Citation
 Blank, JBold, GCotesta, SGuagnano, VRueeger, H Pyrazolo-pyrrolidin-4-one derivatives as bet inhibitors and their use in the treatment of disease US Patent  US9624247 Publication Date 4/18/2017 
Target
Name:
Bromodomain-containing protein 2
Synonyms:
BRD2 Bromodomain and extra-terminal motif (BET) Bromodomain-containing protein 2 (BRD2) RING3
Type:
Protein
Mol. Mass.:
88085.95
Organism:
Homo sapiens (Human)
Description:
P25440
Residue:
801
  
Inhibitor
Name:
BDBM318861
Synonyms:
(R)-6-(4-chlorophenyl)-3-cyclopropyl-5-(3,8-dimethyl-[1,2,4]triazolo[4,3-b]pyridazin-6-yl)-1-methyl-5,6-dihydropyrrolo[3,4-c]pyrazol-4(1H)-one | US9624247, Example 24
Type:
Small organic molecule
Emp. Form.:
C22H20ClN7O
Mol. Mass.:
433.894
SMILES:
Cc1nnc2c(C)cc(nn12)N1[C@@H](c2c(C1=O)c(nn2C)C1CC1)c1ccc(Cl)cc1
: