Target
Proto-oncogene tyrosine-protein kinase receptor Ret [V804M]
Ligand
BDBM284689
Substrate
Meas. Tech.
RET Enzyme Assay
IC50
59.7±n/a nM
Citation
 Andrews, SWBlake, JFChicarelli, MJGolos, AHaas, JJiang, YKolakowski, GR Substituted pyrazolo[1,5-A]pyridine compounds as RET kinase inhibitors US Patent  US10174028 Publication Date 1/8/2019 
Target
Name:
Proto-oncogene tyrosine-protein kinase receptor Ret [V804M]
Synonyms:
CDHF12 PTC RET RET51 ret enzyme (v804m)
Type:
Enzyme Catalytic Domain
Mol. Mass.:
124350.36
Organism:
Homo sapiens (Human)
Description:
P07949[V804M]
Residue:
1114
  
Inhibitor
Name:
BDBM284689
Synonyms:
US10023570, Example 724 | US10174027, Example 724
Type:
Small organic molecule
Emp. Form.:
C28H26N8OS
Mol. Mass.:
522.624
SMILES:
COc1ccc(CN2CCN(CC2)c2ccc(cn2)-c2cc(cn3ncc(C#N)c23)-c2cnc(C)s2)cn1
: