Target
Chromatin remodeling regulator CECR2 [424-538]
Ligand
BDBM321456
Substrate
Meas. Tech.
IC50 Measurements for Inhibitors Using TAF1-BD2 TR-FRET Binding Assay
IC50
1600±n/a nM
Citation
 Albrecht, BKBellon, SFBurdick, DJCote, ACrawford, TDakin, LAHsiao-Wei Tsui, VHewitt, MCLeBlanc, YMagnuson, SRNasveschuk, CGRomero, FATang, YTaylor, AMWang, S Therapeutic compounds and uses thereof US Patent  US10183009 Publication Date 1/22/2019 
Target
Name:
Chromatin remodeling regulator CECR2 [424-538]
Synonyms:
CECR2 CECR2_HUMAN KIAA1740
Type:
Enzyme Catalytic Domain
Mol. Mass.:
13747.10
Organism:
Homo sapiens (Human)
Description:
Q9BXF3[424-538]
Residue:
115
  
Inhibitor
Name:
BDBM321456
Synonyms:
4-[6-[(E)-but-2-enyl]-7-oxo-1H-pyrrolo[2,3-c]pyridin-4-yl]-2-chloro-benzamide | US10183009, Example 44
Type:
Small organic molecule
Emp. Form.:
C18H16ClN3O2
Mol. Mass.:
341.792
SMILES:
C\C=C\Cn1cc(-c2ccc(C(N)=O)c(Cl)c2)c2cc[nH]c2c1=O
: