Target
Carbonic anhydrase 2
Ligand
BDBM11418
Substrate
BDBM10856
Meas. Tech.
CA Inhibition Assay
IC50
2.23±n/a nM
Citation
 Chen, HHGross, SLiao, JMcLaughlin, MDean, TSly, WSMay, JA 2H-Thieno[3,2-e]- and [2,3-e]-1,2-thiazine-6-sulfonamide 1,1-dioxides as ocular hypotensive agents: synthesis, carbonic anhydrase inhibition and evaluation in the rabbit. Bioorg Med Chem 8:957-75 (2000)  
Target
Name:
Carbonic anhydrase 2
Synonyms:
CA-II CAC Carbonate dehydratase II Carbonic anhydrase 2 (CA-II) Carbonic anhydrase C Carbonic anhydrase II (CA-II) Carbonic anhydrase II (hCA II) | Carbonic anhydrase isoenzyme II (hCA II)
Type:
Enzyme
Mol. Mass.:
29250.71
Organism:
Homo sapiens (Human)
Description:
P00918
Residue:
260
  
Inhibitor
Name:
BDBM11418
Synonyms:
2H-Thieno[3,2-e]-1,2-thiazine-6-sulfonamide 1,1-dioxide 25 3-[(1-Imidazolyl)methyl]-2-(3-methoxypropyl)-2H-thieno-[3,2-e]-1,2-thiazine-6-sulfonamide 1,1-dioxide | Compound 17i10
Type:
Small organic molecule
Emp. Form.:
C14H18N4O5S3
Mol. Mass.:
418.512
SMILES:
COCCCN1C(Cn2ccnc2)=Cc2cc(sc2S1(=O)=O)S(N)(=O)=O
:
Substrate
Name:
BDBM10856
Synonyms:
Carbon Dioxide | methanedione
Type:
Small organic molecule
Emp. Form.:
CO2
Mol. Mass.:
44.0095
SMILES:
O=C=O
: