Target
Rho GTPase-activating protein 35
Ligand
BDBM323654
Substrate
Meas. Tech.
Glucocorticoid Receptor Transactivation Potencies for Cortisol and 17-ester Derivatives
EC50
1.05±n/a nM
Citation
 Edelman, JLNehme, A Pharmaceutical compositions and methods of use of 4-pregenen-11β-17-21-triol-3,20-dione derivatives US Patent  US10188667 Publication Date 1/29/2019 
Target
Name:
Rho GTPase-activating protein 35
Synonyms:
ARHGAP35 GRF1 Glucocorticoid receptor DNA-binding factor 1 KIAA1722 RHG35_HUMAN p190-A | p190ARHOGAP
Type:
Enzyme Catalytic Domain
Mol. Mass.:
170514.61
Organism:
Homo sapiens (Human)
Description:
Q9NRY4
Residue:
1499
  
Inhibitor
Name:
BDBM323654
Synonyms:
US10188667, Dexamethasone
Type:
Small organic molecule
Emp. Form.:
C22H31FO5
Mol. Mass.:
394.4769
SMILES:
C[C@@H]1C[C@H]2[C@@H]3CCC4=CC(=O)CC[C@]4(C)[C@@]3(F)[C@@H](O)C[C@]2(C)[C@@]1(O)C(=O)CO
: