Target
Rho GTPase-activating protein 35
Ligand
BDBM323671
Substrate
Meas. Tech.
Glucocorticoid Receptor Transactivation Potencies for Cortisol and 17-ester Derivatives
EC50
1.41±n/a nM
Citation
 Edelman, JLNehme, A Pharmaceutical compositions and methods of use of 4-pregenen-11β-17-21-triol-3,20-dione derivatives US Patent  US10188667 Publication Date 1/29/2019 
Target
Name:
Rho GTPase-activating protein 35
Synonyms:
ARHGAP35 GRF1 Glucocorticoid receptor DNA-binding factor 1 KIAA1722 RHG35_HUMAN p190-A | p190ARHOGAP
Type:
Enzyme Catalytic Domain
Mol. Mass.:
170514.61
Organism:
Homo sapiens (Human)
Description:
Q9NRY4
Residue:
1499
  
Inhibitor
Name:
BDBM323671
Synonyms:
US10188667, Example 00012 | US10188667, Example 00028
Type:
Small organic molecule
Emp. Form.:
C28H34O6
Mol. Mass.:
466.566
SMILES:
C[C@]12C[C@H](O)[C@H]3[C@@H](CCC4=CC(=O)CC[C@]34C)[C@@H]1CC[C@]2(OC(=O)c1ccccc1)C(=O)CO
: