Target
Mineralocorticoid receptor
Ligand
BDBM323674
Substrate
Meas. Tech.
Mineralocorticoid Receptor Transactivation Potencies for Cortisol and 17-ester Derivatives
EC50
9.29±n/a nM
Citation
 Edelman, JLNehme, A Pharmaceutical compositions and methods of use of 4-pregenen-11β-17-21-triol-3,20-dione derivatives US Patent  US10188667 Publication Date 1/29/2019 
Target
Name:
Mineralocorticoid receptor
Synonyms:
MCR MLR NR3C2 | Nuclear receptor subfamily 3 group C member 2
Type:
Enzyme
Mol. Mass.:
107076.42
Organism:
Homo sapiens (Human)
Description:
P08235
Residue:
984
  
Inhibitor
Name:
BDBM323674
Synonyms:
US10188667, Example 00015 US10188667, Example 00026 | US10188667, Example 00029
Type:
Small organic molecule
Emp. Form.:
C28H42O6
Mol. Mass.:
474.6295
SMILES:
CCCCCCC(=O)O[C@@]1(CC[C@H]2[C@@H]3CCC4=CC(=O)CC[C@]4(C)[C@H]3[C@@H](O)C[C@]12C)C(=O)CO
: