Target
Mineralocorticoid receptor
Ligand
BDBM323670
Substrate
Meas. Tech.
Mineralocorticoid Receptor Transactivation Potencies for Cortisol and 17-ester Derivatives
EC50
>100.0±n/a nM
Citation
 Edelman, JLNehme, A Pharmaceutical compositions and methods of use of 4-pregenen-11β-17-21-triol-3,20-dione derivatives US Patent  US10188667 Publication Date 1/29/2019 
Target
Name:
Mineralocorticoid receptor
Synonyms:
MCR MLR NR3C2 | Nuclear receptor subfamily 3 group C member 2
Type:
Enzyme
Mol. Mass.:
107076.42
Organism:
Homo sapiens (Human)
Description:
P08235
Residue:
984
  
Inhibitor
Name:
BDBM323670
Synonyms:
US10188667, Example 00011 | US10188667, Example 00031
Type:
Small organic molecule
Emp. Form.:
C27H38O6
Mol. Mass.:
458.587
SMILES:
C[C@]12C[C@H](O)[C@H]3[C@@H](CCC4=CC(=O)CC[C@]34C)[C@@H]1CC[C@]2(OC(=O)C1CCCC1)C(=O)CO
: