Target
RAF proto-oncogene serine/threonine-protein kinase [306-648,Y340D,Y341D]
Ligand
BDBM190858
Substrate
Meas. Tech.
Raf IC50 Assay
Temperature
298.15±n/a K
IC50
340±n/a nM
Comments
extracted
Citation
 Zhou, CZhang, G Fused tricyclic urea compounds as Raf kinase and/or Raf kinase dimer inhibitors US Patent  US9670203 Publication Date 6/6/2017 
Target
Name:
RAF proto-oncogene serine/threonine-protein kinase [306-648,Y340D,Y341D]
Synonyms:
C-Raf (Y340D/Y341D) RAF1 | RAF1_HUMAN
Type:
Mol. Mass.:
38958.87
Organism:
Homo sapiens (Human)
Description:
PV3805, from Invitrogen
Residue:
343
  
Inhibitor
Name:
BDBM190858
Synonyms:
US9670203, Compound 1.71 1-((1R,1aR,6bR)-5-((7-oxo-5,6,7,8-tetrahydro-1,8-naphthyridin-4-yl)oxy)-1a,6b-dihydro-1H-cyclopropa[b]benzofuran-1-yl)-3-(3-(trifluoromethyl)phenyl)urea
Type:
Small organic molecule
Emp. Form.:
C25H19F3N4O4
Mol. Mass.:
496.438
SMILES:
FC(F)(F)c1cccc(NC(=O)N[C@H]2[C@@H]3Oc4ccc(Oc5ccnc6NC(=O)CCc56)cc4[C@H]23)c1
: