Target
RAF proto-oncogene serine/threonine-protein kinase [306-648,Y340D,Y341D]
Ligand
BDBM190915
Substrate
Meas. Tech.
Raf IC50 Assay
Temperature
298.15±n/a K
IC50
390±n/a nM
Comments
extracted
Citation
 Zhou, CZhang, G Fused tricyclic urea compounds as Raf kinase and/or Raf kinase dimer inhibitors US Patent  US9670203 Publication Date 6/6/2017 
Target
Name:
RAF proto-oncogene serine/threonine-protein kinase [306-648,Y340D,Y341D]
Synonyms:
C-Raf (Y340D/Y341D) RAF1 | RAF1_HUMAN
Type:
Mol. Mass.:
38958.87
Organism:
Homo sapiens (Human)
Description:
PV3805, from Invitrogen
Residue:
343
  
Inhibitor
Name:
BDBM190915
Synonyms:
US9670203, Compound 1.79
Type:
Small organic molecule
Emp. Form.:
C28H26N4O4
Mol. Mass.:
482.5304
SMILES:
O=C(N[C@@H]1[C@H]2Oc3ccc(Oc4ccnc5NC(=O)CCc45)cc3[C@@H]12)N[C@H]1CCCc2ccccc12
: