Target
Carbonic anhydrase 1
Ligand
BDBM11616
Substrate
BDBM10856
Meas. Tech.
CA Inhibition Assay
Ki
5.7±n/a nM
Citation
 Ilies, MAVullo, DPastorek, JScozzafava, AIlies, MCaproiu, MTPastorekova, SSupuran, CT Carbonic anhydrase inhibitors. Inhibition of tumor-associated isozyme IX by halogenosulfanilamide and halogenophenylaminobenzolamide derivatives. J Med Chem 46:2187-96 (2003)  
Target
Name:
Carbonic anhydrase 1
Synonyms:
CA-I CAB Carbonate dehydratase I Carbonic anhydrase 1 (CA I) Carbonic anhydrase 1 (Recombinant CA I) Carbonic anhydrase B Carbonic anhydrase I (CA I) Carbonic anhydrase I (CAI) Carbonic anhydrase isoenzyme I (hCA I) | hCA
Type:
Enzyme
Mol. Mass.:
28873.37
Organism:
Homo sapiens (Human)
Description:
P00915
Residue:
261
  
Inhibitor
Name:
BDBM11616
Synonyms:
5-(4-Acetamido-3-fluorobenzenesulfonamido)-1,3,4-thiadiazole-2-sulfonamide aminobenzolamide 16b | aminobenzolamide deriv. 40
Type:
Small organic molecule
Emp. Form.:
C10H10FN5O5S3
Mol. Mass.:
395.41
SMILES:
CC(=O)Nc1ccc(cc1F)S(=O)(=O)Nc1nnc(s1)S(N)(=O)=O
:
Substrate
Name:
BDBM10856
Synonyms:
Carbon Dioxide | methanedione
Type:
Small organic molecule
Emp. Form.:
CO2
Mol. Mass.:
44.0095
SMILES:
O=C=O
: