Target
Carbonic anhydrase 2
Ligand
BDBM10881
Substrate
BDBM10856
Meas. Tech.
CA Inhibition Assay
Ki
14±n/a nM
Citation
 Ilies, MAVullo, DPastorek, JScozzafava, AIlies, MCaproiu, MTPastorekova, SSupuran, CT Carbonic anhydrase inhibitors. Inhibition of tumor-associated isozyme IX by halogenosulfanilamide and halogenophenylaminobenzolamide derivatives. J Med Chem 46:2187-96 (2003)  
Target
Name:
Carbonic anhydrase 2
Synonyms:
CA-II CAC Carbonate dehydratase II Carbonic anhydrase 2 (CA-II) Carbonic anhydrase C Carbonic anhydrase II (CA-II) Carbonic anhydrase II (hCA II) | Carbonic anhydrase isoenzyme II (hCA II)
Type:
Enzyme
Mol. Mass.:
29250.71
Organism:
Homo sapiens (Human)
Description:
P00918
Residue:
260
  
Inhibitor
Name:
BDBM10881
Synonyms:
CHEMBL288100 Methazolamide Methazolamide, MZA Sulfonamide, 2 sulfonamide 2
Type:
Small organic molecule
Emp. Form.:
C5H8N4O3S2
Mol. Mass.:
236.272
SMILES:
CC(=O)N=c1sc(nn1C)S(N)(=O)=O
:
Substrate
Name:
BDBM10856
Synonyms:
Carbon Dioxide | methanedione
Type:
Small organic molecule
Emp. Form.:
CO2
Mol. Mass.:
44.0095
SMILES:
O=C=O
: