Target
Carbonic anhydrase 9
Ligand
BDBM11616
Substrate
BDBM10856
Meas. Tech.
CA Inhibition Assay
Ki
79±n/a nM
Citation
 Ilies, MAVullo, DPastorek, JScozzafava, AIlies, MCaproiu, MTPastorekova, SSupuran, CT Carbonic anhydrase inhibitors. Inhibition of tumor-associated isozyme IX by halogenosulfanilamide and halogenophenylaminobenzolamide derivatives. J Med Chem 46:2187-96 (2003)  
Target
Name:
Carbonic anhydrase 9
Synonyms:
CA-IX CAH9_HUMAN Carbonic anhydrase 9 (CA IX) Carbonic anhydrase 9 precursor Carbonic anhydrase IX (CAIX) Carbonic anhydrases; II & IX MN RCC-associated antigen G250
Type:
Enzyme
Mol. Mass.:
49669.03
Organism:
Homo sapiens (Human)
Description:
Catalytic domain of human cloned isozyme was used in the assay
Residue:
459
  
Inhibitor
Name:
BDBM11616
Synonyms:
5-(4-Acetamido-3-fluorobenzenesulfonamido)-1,3,4-thiadiazole-2-sulfonamide aminobenzolamide 16b | aminobenzolamide deriv. 40
Type:
Small organic molecule
Emp. Form.:
C10H10FN5O5S3
Mol. Mass.:
395.41
SMILES:
CC(=O)Nc1ccc(cc1F)S(=O)(=O)Nc1nnc(s1)S(N)(=O)=O
:
Substrate
Name:
BDBM10856
Synonyms:
Carbon Dioxide | methanedione
Type:
Small organic molecule
Emp. Form.:
CO2
Mol. Mass.:
44.0095
SMILES:
O=C=O
: