Target
Muscarinic acetylcholine receptor M3
Ligand
BDBM325606
Substrate
Meas. Tech.
M3 Binding Assay
IC50
0.500±n/a nM
Citation
 Amari, GArmani, EBlackaby, WVan De Poeol, HBaker-Glenn, CTrivedi, N Aminoester derivatives US Patent  US9636336 Publication Date 5/2/2017 
Target
Name:
Muscarinic acetylcholine receptor M3
Synonyms:
ACM3_HUMAN Cholinergic, muscarinic M3 Muscarinic receptor M3 | RecName: Full=Muscarinic acetylcholine receptor M3
Type:
Enzyme
Mol. Mass.:
66151.03
Organism:
Homo sapiens (Human)
Description:
P20309
Residue:
590
  
Inhibitor
Name:
BDBM325606
Synonyms:
US9636336, Example 87c
Type:
Small organic molecule
Emp. Form.:
C35H37Cl2N3O7S
Mol. Mass.:
714.655
SMILES:
COc1ccc(cc1OC)[C@H](Cc1c(Cl)c[n+]([O-])cc1Cl)OC(=O)c1ccc(CNC(C(=O)OC2CCN(C)CC2)c2ccccc2)s1
: