Target
Carboxypeptidase B2
Ligand
BDBM326393
Substrate
Meas. Tech.
Enzyme Inhibitory Assay
IC50
8.70±n/a nM
Citation
 Nagata, TKobayashi, JOnishi, YKishida, MNoguchi, K Cyclopropanecarboxylic acid derivative US Patent  US9662310 Publication Date 5/30/2017 
Target
Name:
Carboxypeptidase B2
Synonyms:
CBPB2_HUMAN CPU Carboxypeptidase B2 isoform A Plasma carboxypeptidase B Thrombin-activable fibrinolysis inhibitor | pCPB
Type:
Enzyme
Mol. Mass.:
48432.74
Organism:
Homo sapiens (Human)
Description:
Q96IY4
Residue:
423
  
Inhibitor
Name:
BDBM326393
Synonyms:
(1R,2S)-2-[(2R)-3-Amino-2-methylpropyl]-1-[1-(5-methylpyridin-2-yl)-1H-imidazol-4-yl]cyclopropanecarboxylic acid | US9662310, Example 58
Type:
Small organic molecule
Emp. Form.:
C17H22N4O2
Mol. Mass.:
314.3822
SMILES:
C[C@@H](CN)C[C@H]1C[C@]1(C(O)=O)c1cn(cn1)-c1ccc(C)cn1
: