Target
Voltage-dependent L-type calcium channel subunit alpha-1C/L-type calcium channel subunit beta-3/calcium channel subunit alpha-2/delta-1
Ligand
BDBM327850
Substrate
Meas. Tech.
Binding Assay
IC50
165±n/a nM
Citation
 Meghani, PKricek, F γ-aminobutyric acid (GABA) analogues for the treatment of pain and other disorders US Patent  US9663479 Publication Date 5/30/2017 
Target
Name:
Voltage-dependent L-type calcium channel subunit alpha-1C/L-type calcium channel subunit beta-3/calcium channel subunit alpha-2/delta-1
Synonyms:
Cav1.2/β3/α2δ-1 Calcium Channel
Type:
Protein
Mol. Mass.:
Description:
Components:
This complex has 3 components.
Component 1
Name:
Voltage-dependent L-type calcium channel subunit alpha-1C
Synonyms:
CAC1C_HUMAN CACN2 CACNL1A1 Calcium channel (Type L) L-type calcium channel alpha-1c/beta-2/alpha2delta-1 Voltage-gated L-type calcium channel Voltage-gated calcium channel | Voltage-gated calcium channel subunit alpha Cav1.2
Type:
Enzyme Catalytic Domain
Mol. Mass.:
248979.79
Organism:
Homo sapiens (Human)
Description:
Calcium channel (Type L) 0 HUMAN::Q13936
Residue:
2221
  
Component 2
Name:
Voltage-dependent L-type calcium channel subunit beta-3
Synonyms:
CACB3_HUMAN CACNLB3 | Calcium channel voltage-dependent subunit beta 3
Type:
Enzyme
Mol. Mass.:
54529.25
Organism:
Homo sapiens (Human)
Description:
P54284
Residue:
484
  
Component 3
Name:
Voltage-dependent calcium channel subunit alpha-2/delta-1
Synonyms:
CA2D1_HUMAN CACNL2A MHS3 Voltage-dependent calcium channel subunit delta-1 Voltage-gated calcium channel alpha2/delta subunit 1 | Voltage-gated calcium channel subunit alpha-2/delta-1
Type:
Enzyme
Mol. Mass.:
124544.88
Organism:
Homo sapiens (Human)
Description:
P54289
Residue:
1103
  
Inhibitor
Name:
BDBM327850
Synonyms:
US9663479, Formula 2 peak 1 (Chiral)
Type:
Small organic molecule
Emp. Form.:
C12H19N5
Mol. Mass.:
233.3128
SMILES:
CCC1=CC2C(C[C@@]2(CN)Cc2nn[nH]n2)C1
: