Target
5-hydroxytryptamine receptor 6
Ligand
BDBM328377
Substrate
Meas. Tech.
Biological Assay
IC50
1.30±n/a nM
Citation
 Zhang, YJin, CZhong, WZhang, JGao, LChen, K Aromatic heterocyclic compounds and their application in pharmaceuticals US Patent  US9663498 Publication Date 5/30/2017 
Target
Name:
5-hydroxytryptamine receptor 6
Synonyms:
5-HT-6 5-hydroxytryptamine receptor 6 (5-HT-6) 5-hydroxytryptamine receptor 6 (5HT6) HTR6 Serotonin 6 (5-HT6) receptor | Serotonin Receptor 6
Type:
G Protein-Coupled Receptor (GPCR)
Mol. Mass.:
46968.43
Organism:
Homo sapiens (Human)
Description:
P50406
Residue:
440
  
Inhibitor
Name:
BDBM328377
Synonyms:
6-fluoro-1-((4-methoxy-3-(piperazin-1-yl)phenyl)sulfonyl)-1H-indole | US9663498, Example 17
Type:
Small organic molecule
Emp. Form.:
C19H20FN3O3S
Mol. Mass.:
389.444
SMILES:
COc1ccc(cc1N1CCNCC1)S(=O)(=O)n1ccc2ccc(F)cc12
: