Target
5-hydroxytryptamine receptor 6
Ligand
BDBM328400
Substrate
Meas. Tech.
Biological Assay
IC50
0.140±n/a nM
Citation
 Zhang, YJin, CZhong, WZhang, JGao, LChen, K Aromatic heterocyclic compounds and their application in pharmaceuticals US Patent  US9663498 Publication Date 5/30/2017 
Target
Name:
5-hydroxytryptamine receptor 6
Synonyms:
5-HT-6 5-hydroxytryptamine receptor 6 (5-HT-6) 5-hydroxytryptamine receptor 6 (5HT6) HTR6 Serotonin 6 (5-HT6) receptor | Serotonin Receptor 6
Type:
G Protein-Coupled Receptor (GPCR)
Mol. Mass.:
46968.43
Organism:
Homo sapiens (Human)
Description:
P50406
Residue:
440
  
Inhibitor
Name:
BDBM328400
Synonyms:
3-(difluoromethyl)-1-((4-methoxy-3-(4-methylpiperazin-1-yl) phenyl)sulfonyl)-6-(trifluoromethyl)-1H-indole | US9663498, Example 45
Type:
Small organic molecule
Emp. Form.:
C22H22F5N3O3S
Mol. Mass.:
503.485
SMILES:
COc1ccc(cc1N1CCN(C)CC1)S(=O)(=O)n1cc(C(F)F)c2ccc(cc12)C(F)(F)F
: