Target
5-hydroxytryptamine receptor 6
Ligand
BDBM328412
Substrate
Meas. Tech.
Biological Assay
IC50
0.450±n/a nM
Citation
 Zhang, YJin, CZhong, WZhang, JGao, LChen, K Aromatic heterocyclic compounds and their application in pharmaceuticals US Patent  US9663498 Publication Date 5/30/2017 
Target
Name:
5-hydroxytryptamine receptor 6
Synonyms:
5-HT-6 5-hydroxytryptamine receptor 6 (5-HT-6) 5-hydroxytryptamine receptor 6 (5HT6) HTR6 Serotonin 6 (5-HT6) receptor | Serotonin Receptor 6
Type:
G Protein-Coupled Receptor (GPCR)
Mol. Mass.:
46968.43
Organism:
Homo sapiens (Human)
Description:
P50406
Residue:
440
  
Inhibitor
Name:
BDBM328412
Synonyms:
6-chloro-3-ethyl-1-((4-methoxy-3-(piperazin-1-yl)phenyl)sulfonyl)-1H-indole | US9663498, Example 71
Type:
Small organic molecule
Emp. Form.:
C21H24ClN3O3S
Mol. Mass.:
433.952
SMILES:
CCc1cn(c2cc(Cl)ccc12)S(=O)(=O)c1ccc(OC)c(c1)N1CCNCC1
: