Target
Nuclear receptor ROR-gamma
Ligand
BDBM328445
Substrate
Meas. Tech.
Biochemical TR-FRET assay
IC50
8.26±n/a nM
Citation
 Aicher, TDVanHuis, CAMacLean, JAndresen, BMBarr, KJBienstock, CAnthony, NJDaniels, MLiu, YWhite, CLapointe, BTSciammetta, NSimov, VTrotter, WBLiu, K 2-Acylamidomethyl and sulfonylamidomethyl benzoxazine carbamates for inhibition of RORgamma activity and the treatment of disease US Patent  US9663502 Publication Date 5/30/2017 
Target
Name:
Nuclear receptor ROR-gamma
Synonyms:
NR1F3 Nuclear receptor ROR-gamma (RORC) RAR-related orphan receptor C (RORc) RORG RZRG Retinoid-related orphan receptor-gamma (RORc)
Type:
Enzyme Catalytic Domain
Mol. Mass.:
58218.40
Organism:
Homo sapiens (Human)
Description:
P51449
Residue:
518
  
Inhibitor
Name:
BDBM328445
Synonyms:
(S)-tert-butyl (2- (acetamidomethyl)-4-((3,4- difluorophenyl)sulfonyl)-3,4- dihydro-2H-benzo[b][1,4]oxazin- 6-yl)carbamate | US9663502, 5AB
Type:
Small organic molecule
Emp. Form.:
C22H25F2N3O6S
Mol. Mass.:
497.512
SMILES:
CC(=O)NC[C@H]1CN(c2cc(NC(=O)OC(C)(C)C)ccc2O1)S(=O)(=O)c1ccc(F)c(F)c1
: