Target
72 kDa type IV collagenase
Ligand
BDBM11878
Substrate
MMP Fluorogenic Peptide Substrate
Meas. Tech.
Enzyme Inhibition Assay
Ki
<0.1±n/a nM
Citation
 Becker, DPVillamil, CIBarta, TEBedell, LJBoehm, TLDecrescenzo, GAFreskos, JNGetman, DPHockerman, SHeintz, RHoward, SCLi, MHMcDonald, JJCarron, CPFunckes-Shippy, CLMehta, PPMunie, GESwearingen, CA Synthesis and structure-activity relationships of beta- and alpha-piperidine sulfone hydroxamic acid matrix metalloproteinase inhibitors with oral antitumor efficacy. J Med Chem 48:6713-30 (2005)  
Target
Name:
72 kDa type IV collagenase
Synonyms:
72 kDa gelatinase CLG4A Gelatinase A (MMP-2) MMP2_HUMAN Matrix metalloproteinase-2 (MMP 2) Matrix metalloproteinases 2 (MMP-2) | TBE-1
Type:
Enzyme
Mol. Mass.:
73870.36
Organism:
Homo sapiens (Human)
Description:
P08253
Residue:
660
  
Inhibitor
Name:
BDBM11878
Synonyms:
1-Acetyl-N-hydroxy-4-{[4-(phenoxyphenyl]sulfonyl}-piperidine-4-carboxamide alpha-sulfone 27h
Type:
Small organic molecule
Emp. Form.:
C20H22N2O6S
Mol. Mass.:
418.463
SMILES:
CC(=O)N1CCC(CC1)(C(=O)NO)S(=O)(=O)c1ccc(Oc2ccccc2)cc1
:
Substrate
Name:
MMP Fluorogenic Peptide Substrate
Synonyms:
Type:
Peptide
Mol. Mass.:
2468.31
Organism:
Description:
Residue:
23