Target
Dipeptidyl peptidase 4
Ligand
BDBM11915
Substrate
BDBM11526
Meas. Tech.
In Vitro DPP-IV Inhibition Assays
pH
7.4±n/a
Temperature
295.15±n/a K
Ki
>10000±n/a nM
Citation
 Zhao, GTaunk, PCMagnin, DRSimpkins, LMRobl, JAWang, ARobertson, JGMarcinkeviciene, JSitkoff, DFParker, RAKirby, MSHamann, LG Diprolyl nitriles as potent dipeptidyl peptidase IV inhibitors. Bioorg Med Chem Lett 15:3992-5 (2005)  
Target
Name:
Dipeptidyl peptidase 4
Synonyms:
CD26 DPP IV DPP4_PIG Dipeptidyl peptidase 4 membrane form Dipeptidyl peptidase IV Dipeptidyl peptidase IV soluble form | T-cell activation antigen CD26
Type:
Enzyme
Mol. Mass.:
88235.21
Organism:
Sus scrofa (pig)
Description:
Residue:
766
  
Inhibitor
Name:
BDBM11915
Synonyms:
(1S,3S,5S)-2-[(2R)-pyrrolidin-2-ylcarbonyl]-2-azabicyclo[3.1.0]hexane-3-carbonitrile | substituted diprolyl nitrile 8
Type:
Small organic molecule
Emp. Form.:
C11H15N3O
Mol. Mass.:
205.2563
SMILES:
O=C([C@H]1CCCN1)N1[C@H]2C[C@H]2C[C@H]1C#N
:
Substrate
Name:
BDBM11526
Synonyms:
1-(2-aminoacetyl)-N-(4-nitrophenyl)pyrrolidine-2-carboxamide Gly-Pro-pNA
Type:
Small organic molecule
Emp. Form.:
C13H16N4O4
Mol. Mass.:
292.2905
SMILES:
NCC(=O)N1CCCC1C(=O)Nc1ccc(cc1)[N+]([O-])=O
: