Target
Sigma non-opioid intracellular receptor 1
Ligand
BDBM312231
Substrate
Meas. Tech.
Receptor Assay
Ki
8.94±1.64 nM
Citation
 McCurdy, CRMesangeau, CChin, FTJames, MLShen, BGambhir, SBiswal, SBehera, D Highly selective sigma receptor ligands and radioligands as probes in nociceptive processing and the pathphysiological study of memory deficits and cognitive disorders US Patent  US9724435 Publication Date 8/8/2017 
Target
Name:
Sigma non-opioid intracellular receptor 1
Synonyms:
Opioid receptor SGMR1_RAT Sigma non-opioid intracellular receptor 1 Sigma-1 | Sigmar1
Type:
Enzyme Catalytic Domain
Mol. Mass.:
25266.54
Organism:
RAT
Description:
Q9R0C9
Residue:
223
  
Inhibitor
Name:
BDBM312231
Synonyms:
US9604926, Compound AZ-59 | US9724435, Compound AZ-59
Type:
Small organic molecule
Emp. Form.:
C22H33N3S2
Mol. Mass.:
403.648
SMILES:
CC(CCCn1c2ccccc2sc1=S)N1CCN(CC1)C1CCCCC1
: