Target
Coagulation factor X
Ligand
BDBM12596
Substrate
BDBM12593
Meas. Tech.
Enzyme Assay and Determination of the Inhibition Constants.
pH
7.5±n/a
Temperature
295.15±n/a K
Ki
1.1±n/a nM
Citation
 Maignan, SGuilloteau, JPChoi-Sledeski, YMBecker, MREwing, WRPauls, HWSpada, APMikol, V Molecular structures of human factor Xa complexed with ketopiperazine inhibitors: preference for a neutral group in the S1 pocket. J Med Chem 46:685-90 (2003)  
Target
Name:
Coagulation factor X
Synonyms:
Activated coagulation factor X (FXa) Coagulation factor X precursor F10 Factor X heavy chain Factor Xa Stuart-Prower factor
Type:
Enzyme
Mol. Mass.:
54726.60
Organism:
Homo sapiens (Human)
Description:
Residue:
488
  
Inhibitor
Name:
BDBM12596
Synonyms:
4-{[(E)-2-(5-CHLOROTHIEN-2-YL)VINYL]SULFONYL}-1-(1H-PYRROLO[3,2-C]PYRIDIN-2-YLMETHYL)PIPERAZIN-2-ONE CHEMBL423417 RPR209685
Type:
Small organic molecule
Emp. Form.:
C18H17ClN4O3S2
Mol. Mass.:
436.936
SMILES:
Clc1ccc(C=CS(=O)(=O)N2CCN(Cc3cc4cnccc4[nH]3)C(=O)C2)s1
:
Substrate
Name:
BDBM12593
Synonyms:
Chromogenic Substrate Spectrozyme FXa Methoxycarbonyl-D-cyclohexylglycyl-glycyl-arginine-para-nitroanilide acetate | acetic acid; methyl N-[(R)-[({[(1S)-4-carbamimidamido-1-[(4-nitrophenyl)carbamoyl]butyl]carbamoyl}methyl)carbamoyl](cyclohexyl)methyl]carbamate
Type:
Small organic molecule
Emp. Form.:
C24H36N8O7
Mol. Mass.:
548.592
SMILES:
COC(=O)N[C@H](C1CCCCC1)C(=O)NCC(=O)N[C@@H](CCCNC(N)=N)C(=O)Nc1ccc(cc1)[N+]([O-])=O
: