Target
Prothrombin
Ligand
BDBM12596
Substrate
BDBM12598
Meas. Tech.
Enzyme Assay and Determination of the Inhibition Constants.
pH
7.5±n/a
Temperature
295.15±n/a K
Ki
>4000±n/a nM
Citation
 Maignan, SGuilloteau, JPChoi-Sledeski, YMBecker, MREwing, WRPauls, HWSpada, APMikol, V Molecular structures of human factor Xa complexed with ketopiperazine inhibitors: preference for a neutral group in the S1 pocket. J Med Chem 46:685-90 (2003)  
Target
Name:
Prothrombin
Synonyms:
Activation peptide fragment 1 Coagulation factor II Prothrombin precursor Thrombin heavy chain | Thrombin light chain
Type:
Protein
Mol. Mass.:
70029.57
Organism:
Homo sapiens (Human)
Description:
P00734
Residue:
622
  
Inhibitor
Name:
BDBM12596
Synonyms:
4-{[(E)-2-(5-CHLOROTHIEN-2-YL)VINYL]SULFONYL}-1-(1H-PYRROLO[3,2-C]PYRIDIN-2-YLMETHYL)PIPERAZIN-2-ONE CHEMBL423417 RPR209685
Type:
Small organic molecule
Emp. Form.:
C18H17ClN4O3S2
Mol. Mass.:
436.936
SMILES:
Clc1ccc(C=CS(=O)(=O)N2CCN(Cc3cc4cnccc4[nH]3)C(=O)C2)s1
:
Substrate
Name:
BDBM12598
Synonyms:
(2S)-2-[(2S)-2-[(2R)-2-amino-2-cyclohexylacetamido]propanamido]-5-carbamimidamido-N-(4-nitrophenyl)pentanamide; bis(acetic acid) H-D-CHG-Ala-Arg-pNA. 2AcOH
Type:
Small organic molecule
Emp. Form.:
C23H36N8O5
Mol. Mass.:
504.5825
SMILES:
C[C@H](NC(=O)[C@H](N)C1CCCCC1)C(=O)N[C@@H](CCCNC(N)=N)C(=O)Nc1ccc(cc1)[N+]([O-])=O
: