Target
Fibroblast growth factor receptor 4
Ligand
BDBM249407
Substrate
Meas. Tech.
Binding Assay
IC50
<1.000±n/a nM
Citation
 Reynolds, DHao, MWang, JPrajapati, SSatoh, TSelvaraj, A Pyrimidine FGFR4 inhibitors US Patent  US9730931 Publication Date 8/15/2017 
Target
Name:
Fibroblast growth factor receptor 4
Synonyms:
CD_antigen: CD334 FGFR4 FGFR4 Fibroblast growth factor receptor JK2 TKF
Type:
Protein
Mol. Mass.:
87957.45
Organism:
Homo sapiens (Human)
Description:
P22455
Residue:
802
  
Inhibitor
Name:
BDBM249407
Synonyms:
US10537571, Compound 124 US9434697, 124 | US9730931, Compound 124
Type:
Small organic molecule
Emp. Form.:
C29H34Cl2N8O4
Mol. Mass.:
629.537
SMILES:
COc1cc(OC)c(Cl)c(NC(=O)N(C)c2cc(Nc3ccc(cc3NC(=O)C=C)N3C[C@H](C)N[C@H](C)C3)ncn2)c1Cl
: