Target
Fibroblast growth factor receptor 4
Ligand
BDBM249427
Substrate
Meas. Tech.
Binding Assay
IC50
<1.000±n/a nM
Citation
 Reynolds, DHao, MWang, JPrajapati, SSatoh, TSelvaraj, A Pyrimidine FGFR4 inhibitors US Patent  US9730931 Publication Date 8/15/2017 
Target
Name:
Fibroblast growth factor receptor 4
Synonyms:
CD_antigen: CD334 FGFR4 FGFR4 Fibroblast growth factor receptor JK2 TKF
Type:
Protein
Mol. Mass.:
87957.45
Organism:
Homo sapiens (Human)
Description:
P22455
Residue:
802
  
Inhibitor
Name:
BDBM249427
Synonyms:
US10537571, Compound 147 US9434697, 147 | US9730931, Compound 147
Type:
Small organic molecule
Emp. Form.:
C25H26Cl2N6O5
Mol. Mass.:
561.417
SMILES:
COCc1ccc(Nc2cc(ncn2)N(C)C(=O)Nc2c(Cl)c(OC)cc(OC)c2Cl)c(NC(=O)C=C)c1
: