Target
Fibroblast growth factor receptor 4
Ligand
BDBM249396
Substrate
Meas. Tech.
Biochemical Kinase Assay
IC50
<0.2±0.0 nM
Citation
 Reynolds, DHao, MWang, JPrajapati, SSatoh, TSelvaraj, A Pyrimidine FGFR4 inhibitors US Patent  US9730931 Publication Date 8/15/2017 
Target
Name:
Fibroblast growth factor receptor 4
Synonyms:
CD_antigen: CD334 FGFR4 FGFR4 Fibroblast growth factor receptor JK2 TKF
Type:
Protein
Mol. Mass.:
87957.45
Organism:
Homo sapiens (Human)
Description:
P22455
Residue:
802
  
Inhibitor
Name:
BDBM249396
Synonyms:
US10537571, Compound 108 US10654836, The compound of example 108 of WO2015057938 US11001572, Example 108 of WO2015057938 US9730931, Compound 108
Type:
Small organic molecule
Emp. Form.:
C29H34Cl2N8O4
Mol. Mass.:
629.537
SMILES:
CCN1CCN(CC1)c1ccc(Nc2cc(ncn2)N(C)C(=O)Nc2c(Cl)c(OC)cc(OC)c2Cl)c(NC(=O)C=C)c1
: