Target
Fibroblast growth factor receptor 1
Ligand
BDBM50355393
Substrate
Meas. Tech.
Biochemical Kinase Assay
IC50
1.0±0.0 nM
Citation
 Reynolds, DHao, MWang, JPrajapati, SSatoh, TSelvaraj, A Pyrimidine FGFR4 inhibitors US Patent  US9730931 Publication Date 8/15/2017 
Target
Name:
Fibroblast growth factor receptor 1
Synonyms:
BFGFR Basic fibroblast growth factor receptor 1 (FGFR1) CEK FGFR-1 FGFR-1, (FL) FGFR1_HUMAN FLT2 Fibroblast growth factor receptor 1 (FGFR-1) Fms-like tyrosine kinase 2 N-sam bFGF-R | c-fgr
Type:
Receptor
Mol. Mass.:
91861.70
Organism:
Homo sapiens (Human)
Description:
P11362
Residue:
822
  
Inhibitor
Name:
BDBM50355393
Synonyms:
BGJ398 US9434697, BGJ398 | US9730931, BGJ398
Type:
Small organic molecule
Emp. Form.:
C26H31Cl2N7O3
Mol. Mass.:
560.475
SMILES:
CCN1CCN(CC1)c1ccc(Nc2cc(ncn2)N(C)C(=O)Nc2c(Cl)c(OC)cc(OC)c2Cl)cc1
: