Target
Androgen receptor
Ligand
BDBM334277
Substrate
Meas. Tech.
Biological Assay
Kd
100.0±n/a nM
Citation
 Poinsard, C N-(pyrid-4-yl)amides and N-(pyrimidin-4-yl)amides and their pharmaceutical and cosmetic use US Patent  US9732044 Publication Date 8/15/2017 
Target
Name:
Androgen receptor
Synonyms:
ANDR_HUMAN Androgen Receptor Androgen receptor/Baculoviral IAP repeat-containing protein 2 Dihydrotestosterone receptor Nuclear receptor subfamily 3 group C member 4
Type:
Receptor
Mol. Mass.:
99185.27
Organism:
Homo sapiens (Human)
Description:
CHO cells were stably transfected with human AR gene.
Residue:
920
  
Inhibitor
Name:
BDBM334277
Synonyms:
N-(2-Bromo-pyridin- 4-yl)-2-hydroxy- 2-methyl-4-phenyl- butyramide | US9732044, 43
Type:
Small organic molecule
Emp. Form.:
C16H17BrN2O2
Mol. Mass.:
349.222
SMILES:
CC(O)(CCc1ccccc1)C(=O)Nc1ccnc(Br)c1
: