Target
Prostaglandin E synthase
Ligand
BDBM197478
Substrate
Meas. Tech.
Inhibition Assay
IC50
1.70±n/a nM
Citation
 Otsu, H Heterocyclic derivative and pharmaceutical drug US Patent  US9732066 Publication Date 8/15/2017 
Target
Name:
Prostaglandin E synthase
Synonyms:
MGST1L1 PGES PTGES Prostaglandin E synthase (PGES-1) Prostaglandin E synthase-1 (PGES-1) Prostaglandin E2 synthase-1 ( mPGES-1)
Type:
Protein
Mol. Mass.:
17112.22
Organism:
Homo sapiens (Human)
Description:
Residue:
152
  
Inhibitor
Name:
BDBM197478
Synonyms:
US9216968, 77 | US9732066, 77
Type:
Small organic molecule
Emp. Form.:
C27H23F6N5O2
Mol. Mass.:
563.4942
SMILES:
CC(C)(C)c1nc2c(cc(NC(=O)c3ccccc3C(F)(F)F)cc2[nH]1)C(=O)NCc1ncccc1C(F)(F)F
: