Target
Prostaglandin E synthase
Ligand
BDBM197503
Substrate
Meas. Tech.
Inhibition Assay
IC50
1.60±n/a nM
Citation
 Otsu, H Heterocyclic derivative and pharmaceutical drug US Patent  US9732066 Publication Date 8/15/2017 
Target
Name:
Prostaglandin E synthase
Synonyms:
MGST1L1 PGES PTGES Prostaglandin E synthase (PGES-1) Prostaglandin E synthase-1 (PGES-1) Prostaglandin E2 synthase-1 ( mPGES-1)
Type:
Protein
Mol. Mass.:
17112.22
Organism:
Homo sapiens (Human)
Description:
Residue:
152
  
Inhibitor
Name:
BDBM197503
Synonyms:
US9216968, 102 | US9732066, 102
Type:
Small organic molecule
Emp. Form.:
C24H19BrCl2N4O3
Mol. Mass.:
562.243
SMILES:
COCc1nc2c(cc(NC(=O)c3c(Cl)cccc3Br)cc2[nH]1)C(=O)Nc1cccc(Cl)c1C
: