Target
Prostaglandin E synthase
Ligand
BDBM197582
Substrate
Meas. Tech.
Inhibition Assay
IC50
1.60±n/a nM
Citation
 Otsu, H Heterocyclic derivative and pharmaceutical drug US Patent  US9732066 Publication Date 8/15/2017 
Target
Name:
Prostaglandin E synthase
Synonyms:
MGST1L1 PGES PTGES Prostaglandin E synthase (PGES-1) Prostaglandin E synthase-1 (PGES-1) Prostaglandin E2 synthase-1 ( mPGES-1)
Type:
Protein
Mol. Mass.:
17112.22
Organism:
Homo sapiens (Human)
Description:
Residue:
152
  
Inhibitor
Name:
BDBM197582
Synonyms:
US9216968, 182 | US9732066, 182
Type:
Small organic molecule
Emp. Form.:
C24H20Cl2FN5O2
Mol. Mass.:
500.352
SMILES:
CN(C)c1nc2c(cc(NC(=O)c3c(F)cccc3Cl)cc2[nH]1)C(=O)Nc1cccc(Cl)c1C
: