Target
Prostaglandin E synthase
Ligand
BDBM197613
Substrate
Meas. Tech.
Inhibition Assay
IC50
0.900±n/a nM
Citation
 Otsu, H Heterocyclic derivative and pharmaceutical drug US Patent  US9732066 Publication Date 8/15/2017 
Target
Name:
Prostaglandin E synthase
Synonyms:
MGST1L1 PGES PTGES Prostaglandin E synthase (PGES-1) Prostaglandin E synthase-1 (PGES-1) Prostaglandin E2 synthase-1 ( mPGES-1)
Type:
Protein
Mol. Mass.:
17112.22
Organism:
Homo sapiens (Human)
Description:
Residue:
152
  
Inhibitor
Name:
BDBM197613
Synonyms:
US9216968, 213 | US9732066, 213
Type:
Small organic molecule
Emp. Form.:
C25H21Cl3N4O3
Mol. Mass.:
531.818
SMILES:
COCCc1nc2c(cc(NC(=O)c3cc(Cl)ccc3Cl)cc2[nH]1)C(=O)Nc1ccc(C)c(Cl)c1
: