Target
Prostaglandin E synthase
Ligand
BDBM197619
Substrate
Meas. Tech.
Inhibition Assay
IC50
2.00±n/a nM
Citation
 Otsu, H Heterocyclic derivative and pharmaceutical drug US Patent  US9732066 Publication Date 8/15/2017 
Target
Name:
Prostaglandin E synthase
Synonyms:
MGST1L1 PGES PTGES Prostaglandin E synthase (PGES-1) Prostaglandin E synthase-1 (PGES-1) Prostaglandin E2 synthase-1 ( mPGES-1)
Type:
Protein
Mol. Mass.:
17112.22
Organism:
Homo sapiens (Human)
Description:
Residue:
152
  
Inhibitor
Name:
BDBM197619
Synonyms:
US9216968, 219 | US9732066, 219
Type:
Small organic molecule
Emp. Form.:
C28H21F3N4O3
Mol. Mass.:
518.4865
SMILES:
COCc1nc2c(cc(NC(=O)c3ccccc3C(F)(F)F)cc2[nH]1)C(=O)Nc1cccc2ccccc12
: