Target
Protein arginine N-methyltransferase 5
Ligand
BDBM297726
Substrate
Meas. Tech.
Biochemical Assay
IC50
<100±n/a nM
Citation
 Duncan, KWChesworth, RBoriack-Sjodin, PAMunchhof, MJ PRMT5 inhibitors and uses thereof US Patent  US9732072 Publication Date 8/15/2017 
Target
Name:
Protein arginine N-methyltransferase 5
Synonyms:
72 kDa ICln-binding protein HRMT1L5 IBP72 Jak-binding protein 1 PRMT5/MEP50 complex Protein arginine methyltransferase 5 (PRMT5) SKB1 homolog Shk1 kinase-binding protein 1 homolog
Type:
Enzyme
Mol. Mass.:
72679.99
Organism:
Homo sapiens (Human)
Description:
O14744
Residue:
637
  
Inhibitor
Name:
BDBM297726
Synonyms:
(R)No FitNNo Fit((S)-2-hydroxy-3-(isoindolin-2-yl)propyl)-2-(quinolin-8-yloxy)propanamide US9732072, Compound 5
Type:
Small organic molecule
Emp. Form.:
C23H25N3O3
Mol. Mass.:
391.4629
SMILES:
C[C@@H](Oc1cccc2cccnc12)C(=O)NC[C@H](O)CN1Cc2ccccc2C1
: