Target
Protein arginine N-methyltransferase 5
Ligand
BDBM297735
Substrate
Meas. Tech.
Biochemical Assay
IC50
30000±n/a nM
Citation
 Duncan, KWChesworth, RBoriack-Sjodin, PAMunchhof, MJ PRMT5 inhibitors and uses thereof US Patent  US9732072 Publication Date 8/15/2017 
Target
Name:
Protein arginine N-methyltransferase 5
Synonyms:
72 kDa ICln-binding protein HRMT1L5 IBP72 Jak-binding protein 1 PRMT5/MEP50 complex Protein arginine methyltransferase 5 (PRMT5) SKB1 homolog Shk1 kinase-binding protein 1 homolog
Type:
Enzyme
Mol. Mass.:
72679.99
Organism:
Homo sapiens (Human)
Description:
O14744
Residue:
637
  
Inhibitor
Name:
BDBM297735
Synonyms:
US10118918, Compound 14 | US9732072, Compound 14
Type:
Small organic molecule
Emp. Form.:
C25H25N3O2
Mol. Mass.:
399.4849
SMILES:
Cn1cnc2ccc(cc12)-c1cccc(OC[C@@H](O)CN2Cc3ccccc3C2)c1
: